BDBM50501609 CHEMBL4081497
SMILES Cc1nc(NC2CCCC2)sc1-c1ccnc(Nc2ccc(cn2)N2CCOCC2)n1
InChI Key InChIKey=UGKFAPJXEKVBHI-UHFFFAOYSA-N
Data  4 KI  6 IC50
  Tab Delimited (TSV)   2D SDfile   Computed 3D by Vconf -m prep SDfile
Find this compound or compounds like it in BindingDB:
Activity Spreadsheet -- Enzyme Inhibition Constant Data from BindingDB
Found 10 hits for monomerid = 50501609
TargetCyclin-dependent kinase 4/G1/S-specific cyclin-D1(Homo sapiens (Human))
University Of South Australia
Curated by ChEMBL
LigandPNGBDBM50501609(CHEMBL4081497)
Affinity DataKi:  4nM. Assay description: Inhibition of CDK4/cyclin D1 (unknown origin) in presence of [gamma-33P]-ATP by KINOMEscan assay
Ligand InfoPC cidPC sid
In DepthDetails ArticlePubMed
TargetCyclin-dependent kinase 6/G1/S-specific cyclin-D3(Homo sapiens (Human))
University Of South Australia
Curated by ChEMBL
LigandPNGBDBM50501609(CHEMBL4081497)
Affinity DataKi:  30nM. Assay description: Inhibition of CDK6/cyclin D3 (unknown origin) in presence of [gamma-33P]-ATP by KINOMEscan assay
Ligand InfoPC cidPC sid
In DepthDetails ArticlePubMed
TargetCyclin-A2/Cyclin-dependent kinase 2(Homo sapiens (Human))
University Of South Australia
Curated by ChEMBL
LigandPNGBDBM50501609(CHEMBL4081497)
Affinity DataKi:  4.68E+3nM. Assay description: Inhibition of CDK2/cyclin A (unknown origin) in presence of [gamma-33P]-ATP by KINOMEscan assay
Ligand InfoPC cidPC sid
In DepthDetails ArticlePubMed
TargetCyclin-T1/Cyclin-dependent kinase 9(Homo sapiens (Human))
University Of South Australia
Curated by ChEMBL
LigandPNGBDBM50501609(CHEMBL4081497)
Affinity DataKi: >5.00E+3nM. Assay description: Inhibition of CDK9/cyclin T1 (unknown origin) in presence of [gamma-33P]-ATP by KINOMEscan assay
Ligand InfoPC cidPC sid
In DepthDetails ArticlePubMed
TargetPotassium voltage-gated channel subfamily H member 2(Homo sapiens (Human))
University Of South Australia
Curated by ChEMBL
LigandPNGBDBM50501609(CHEMBL4081497)
Affinity DataIC50: >1.00E+4nM. Assay description: Inhibition of human ERG expressed in CHO cells by patch clamp electrophysiology
Ligand InfoPC cidPC sid
In DepthDetails ArticlePubMed
TargetCytochrome P450 2C19(Homo sapiens (Human))
University Of South Australia
Curated by ChEMBL
LigandPNGBDBM50501609(CHEMBL4081497)
Affinity DataIC50: >2.50E+4nM. Assay description: Inhibition of CYP2C19 in human liver microsomes using mephenytoin as substrate in presence of NADPH
Ligand InfoPC cidPC sid
In DepthDetails ArticlePubMed
TargetCytochrome P450 2C9(Homo sapiens (Human))
University Of South Australia
Curated by ChEMBL
LigandPNGBDBM50501609(CHEMBL4081497)
Affinity DataIC50: >2.50E+4nM. Assay description: Inhibition of CYP2C9 in human liver microsomes using tolbutamide as substrate in presence of NADPH
Ligand InfoPC cidPC sid
In DepthDetails ArticlePubMed
TargetCytochrome P450 2D6(Homo sapiens (Human))
University Of South Australia
Curated by ChEMBL
LigandPNGBDBM50501609(CHEMBL4081497)
Affinity DataIC50: >2.50E+4nM. Assay description: Inhibition of CYP2D6 in human liver microsomes using dextromethorphan as substrate in presence of NADPH
Ligand InfoPC cidPC sid
In DepthDetails ArticlePubMed
TargetCytochrome P450 3A4(Homo sapiens (Human))
University Of South Australia
Curated by ChEMBL
LigandPNGBDBM50501609(CHEMBL4081497)
Affinity DataIC50: >2.50E+4nM. Assay description: Inhibition of CYP3A4 in human liver microsomes using midazolam as substrate in presence of NADPH
Ligand InfoPC cidPC sid
In DepthDetails ArticlePubMed
TargetCytochrome P450 1A2(Homo sapiens (Human))
University Of South Australia
Curated by ChEMBL
LigandPNGBDBM50501609(CHEMBL4081497)
Affinity DataIC50: >2.50E+4nM. Assay description: Inhibition of CYP1A2 in human liver microsomes using ethoxyresorufin as substrate in presence of NADPH
Ligand InfoPC cidPC sid
In DepthDetails ArticlePubMed