BDBM50502064 CHEMBL4459920
SMILES Cc1ccc(cc1)C(c1c[nH]c2ccc(cc12)C(=O)NNS(=O)(=O)c1ccc(C)cc1)c1c[nH]c2ccc(cc12)C(=O)NNS(=O)(=O)c1ccc(C)cc1
InChI Key InChIKey=NDKDJTJPQZFXFS-UHFFFAOYSA-N
Data  1 IC50
  Tab Delimited (TSV)   2D SDfile   Computed 3D by Vconf -m prep SDfile
Find this compound or compounds like it in BindingDB:
Activity Spreadsheet -- Enzyme Inhibition Constant Data from BindingDB
Found 1 hit for monomerid = 50502064
TargetProbable maltase-glucoamylase 2(Homo sapiens)
Babasaheb Bhimrao Ambedkar University (A Central University)
Curated by ChEMBL
LigandPNGBDBM50502064(CHEMBL4459920)
Affinity DataIC50:  100nM. Assay description: Inhibition of alpha-glucosidase (unknown origin) using p-nitrophenyl-alpha-d-glucopyranoside as substrate preincubated for 15 mins followed by substr...
Ligand InfoPC cidPC sid
In DepthDetails ArticlePubMed