BDBM50502344 Talinolol
SMILES CC(C)(C)NCC(O)COc1ccc(NC(=O)NC2CCCCC2)cc1
InChI Key InChIKey=MXFWWQICDIZSOA-UHFFFAOYSA-N
Data  2 KI  1 IC50
PDB links: 1 PDB ID matches this monomer.
  Tab Delimited (TSV)   2D SDfile   Computed 3D by Vconf -m prep SDfile
Find this compound or compounds like it in BindingDB:
Activity Spreadsheet -- Enzyme Inhibition Constant Data from BindingDB
Found 3 hits for monomerid = 50502344
TargetBeta-1 adrenergic receptor(Homo sapiens (Human))
Goethe-University Of Frankfurt
Curated by ChEMBL
LigandPNGBDBM50502344(Talinolol)
Affinity DataKi:  240nM. Assay description: Binding affinity to beta1 adrenergic receptor (unknown origin) by radioligand binding assay
In DepthDetails ArticlePubMed
TargetBeta-2 adrenergic receptor(Homo sapiens (Human))
Goethe-University Of Frankfurt
Curated by ChEMBL
LigandPNGBDBM50502344(Talinolol)
Affinity DataKi:  900nM. Assay description: Binding affinity to beta2 adrenergic receptor (unknown origin) by radioligand binding assay
In DepthDetails ArticlePubMed
TargetBifunctional epoxide hydrolase 2(Homo sapiens (Human))
Goethe-University Of Frankfurt
Curated by ChEMBL
LigandPNGBDBM50502344(Talinolol)
Affinity DataIC50:  2.80E+3nM. Assay description: Inhibition of recombinant human full length soluble epoxide hydrolase (1 to 555 residues) expressed in Escherichia coli BL21(DE3) using non-fluoresce...