BDBM50502433 CHEMBL4575866
SMILES CCCOC(=O)N1CCN(CC1)C(=O)c1ccc2c(Cl)cc(nc2c1)-c1ccc(cc1)C(=O)NC
InChI Key InChIKey=PWXZDAKDUSEPIY-UHFFFAOYSA-N
Data  1 KI  1 IC50
  Tab Delimited (TSV)   2D SDfile   Computed 3D by Vconf -m prep SDfile
Find this compound or compounds like it in BindingDB:
Activity Spreadsheet -- Enzyme Inhibition Constant Data from BindingDB
Found 2 hits for monomerid = 50502433
TargetHistone-lysine N-methyltransferase SMYD3(Homo sapiens (Human))
Experimental Drug Development Centre
Curated by ChEMBL
LigandPNGBDBM50502433(CHEMBL4575866)
Affinity DataKi:  3.06E+3nM. Assay description: Irreversible inhibition of SMYD3 (unknown origin) using MAP3K2 peptide as substrate pretreated for 5 mins followed by substrate addition and measured...
Ligand InfoPC cidPC sid
In DepthDetails ArticlePubMed
TargetHistone-lysine N-methyltransferase SMYD3(Homo sapiens (Human))
Experimental Drug Development Centre
Curated by ChEMBL
LigandPNGBDBM50502433(CHEMBL4575866)
Affinity DataIC50:  250nM. Assay description: Inhibition of SMYD3 (unknown origin) using MAP3K2 peptide as substrate pretreated for 30 mins followed by substrate addition and measured after 30 mi...
Ligand InfoPC cidPC sid
In DepthDetails ArticlePubMed