BDBM50502451 CHEMBL4454921
SMILES N[C@@H](CCN(C[C@H]1O[C@H]([C@H](O)[C@@H]1O)n1cnc2c(N)ncnc12)Cc1ccc2ccccc2c1)C(O)=O
InChI Key InChIKey=FISQGTLCZLBIAR-XCPBYIKRSA-N
Data  2 IC50  1 Kd
  Tab Delimited (TSV)   2D SDfile   Computed 3D by Vconf -m prep SDfile
Find this compound or compounds like it in BindingDB:
Activity Spreadsheet -- Enzyme Inhibition Constant Data from BindingDB
Found 3 hits for monomerid = 50502451
TargetNicotinamide N-methyltransferase(Homo sapiens (Human))
Leiden University
Curated by ChEMBL
LigandPNGBDBM50502451(CHEMBL4454921)
Affinity DataIC50:  1.41E+3nM. Assay description: Inhibition of wild-type human full length NNMT expressed in Escherichia coli BL21(DE3) cells assessed as reduction in 1-methyl-nicotinamide formation...
In DepthDetails ArticlePubMed
TargetNicotinamide N-methyltransferase(Homo sapiens (Human))
Leiden University
Curated by ChEMBL
LigandPNGBDBM50502451(CHEMBL4454921)
Affinity DataIC50:  5.95E+3nM. Assay description: Inhibition of recombinant NNMT (unknown origin) assessed as reduction in MNA concentration incubated for 10 mins measured after 30 mins by LC-MS/MS-M...
In DepthDetails PubMed
TargetNicotinamide N-methyltransferase(Homo sapiens (Human))
Leiden University
Curated by ChEMBL
LigandPNGBDBM50502451(CHEMBL4454921)
Affinity DataKd:  5.55E+3nM. Assay description: Binding affinity to wild-type human full length NNMT expressed in Escherichia coli BL21(DE3)-codonplus-RIL cells by isothermal titration calorimetry
In DepthDetails ArticlePubMed