BDBM50502596 CHEMBL4473647
SMILES C[C@]1(Cn2cnnc2C(N)=N1)c1cc(NC(=O)c2ccc(cn2)C#N)ccc1F
InChI Key InChIKey=ZSMIUGRYJRMLRW-IBGZPJMESA-N
Data  4 IC50
  Tab Delimited (TSV)   2D SDfile   Computed 3D by Vconf -m prep SDfile
Find this compound or compounds like it in BindingDB:
Activity Spreadsheet -- Enzyme Inhibition Constant Data from BindingDB
Found 4 hits for monomerid = 50502596
TargetPotassium voltage-gated channel subfamily H member 1(Homo sapiens)
Janssen Research & Development
Curated by ChEMBL
LigandPNGBDBM50502596(CHEMBL4473647)
Affinity DataIC50: >1.00E+4nM. Assay description: Inhibition of human ERG
Ligand InfoPC cidPC sid
In DepthDetails ArticlePubMed
TargetBeta-secretase 1(Homo sapiens (Human))
Janssen Research & Development
Curated by ChEMBL
LigandPNGBDBM50502596(CHEMBL4473647)
Affinity DataIC50:  6.60nM. Assay description: Inhibition of BACE1 in human SKNBE2 cells expressing wild type amyloid precursor protein (APP695) assessed as amyloid beta42 level incubated for 18 h...
Ligand InfoPC cidPC sid
In DepthDetails ArticlePubMed
TargetBeta-secretase 1(Homo sapiens (Human))
Janssen Research & Development
Curated by ChEMBL
LigandPNGBDBM50502596(CHEMBL4473647)
Affinity DataIC50:  11nM. Assay description: Inhibition of BACE1 (unknown origin)
Ligand InfoPC cidPC sid
In DepthDetails ArticlePubMed
TargetBeta-secretase 2(Homo sapiens (Human))
Janssen Research & Development
Curated by ChEMBL
LigandPNGBDBM50502596(CHEMBL4473647)
Affinity DataIC50:  56nM. Assay description: Inhibition of BACE2 (unknown origin)
Ligand InfoPC cidPC sid
In DepthDetails ArticlePubMed