BDBM50504068 CHEMBL4465468
SMILES OC(=O)c1cccc(Nc2cc(O)cc3ccccc23)c1
InChI Key InChIKey=WOUHSCSBSOATIU-UHFFFAOYSA-N
Data  1 KI
  Tab Delimited (TSV)   2D SDfile   Computed 3D by Vconf -m prep SDfile
Find this compound or compounds like it in BindingDB:
Activity Spreadsheet -- Enzyme Inhibition Constant Data from BindingDB
Found 1 hit for monomerid = 50504068
TargetM-phase inducer phosphatase 2(Homo sapiens (Human))
University Of Naples Federico Ii
Curated by ChEMBL
LigandPNGBDBM50504068(CHEMBL4465468)
Affinity DataKi:  5.80E+3nM. Assay description: Non-competitive inhibition of N-terminal His6-tagged human CDC25B (377 to 550 residues) expressed in Escherichia coli BL21(DE3) cells using OMFP as s...
Ligand InfoPC cidPC sid
In DepthDetails ArticlePubMed