BDBM50504072 CHEMBL4561981
SMILES OC(=O)c1cccc(Nc2cccc3ccccc23)c1
InChI Key InChIKey=LWWLUMAYVUEYMG-UHFFFAOYSA-N
Data  1 KI
  Tab Delimited (TSV)   2D SDfile   Computed 3D by Vconf -m prep SDfile
Find this compound or compounds like it in BindingDB:
Activity Spreadsheet -- Enzyme Inhibition Constant Data from BindingDB
Found 1 hit for monomerid = 50504072
TargetM-phase inducer phosphatase 2(Homo sapiens (Human))
University Of Naples Federico Ii
Curated by ChEMBL
LigandPNGBDBM50504072(CHEMBL4561981)
Affinity DataKi:  3.00E+4nM. Assay description: Mixed inhibition of N-terminal His6-tagged human CDC25B (377 to 550 residues) expressed in Escherichia coli BL21(DE3) cells using OMFP as substrate b...
Ligand InfoPC cidPC sid
In DepthDetails ArticlePubMed