BDBM50504076 CHEMBL4543585
SMILES COc1cc(Nc2cccc(c2)C(O)=O)c2ccccc2c1
InChI Key InChIKey=HMFCVXCVYHSOTB-UHFFFAOYSA-N
Data  1 KI
  Tab Delimited (TSV)   2D SDfile   Computed 3D by Vconf -m prep SDfile
Find this compound or compounds like it in BindingDB:
Activity Spreadsheet -- Enzyme Inhibition Constant Data from BindingDB
Found 1 hit for monomerid = 50504076
TargetM-phase inducer phosphatase 2(Homo sapiens (Human))
University Of Naples Federico Ii
Curated by ChEMBL
LigandPNGBDBM50504076(CHEMBL4543585)
Affinity DataKi:  5.50E+4nM. Assay description: Uncompetitive inhibition of N-terminal His6-tagged human CDC25B (377 to 550 residues) expressed in Escherichia coli BL21(DE3) cells using OMFP as sub...
Ligand InfoPC cidPC sid
In DepthDetails ArticlePubMed