BDBM50504081 CHEMBL4442999
SMILES OC(=O)c1ccccc1Nc1cc(O)cc2ccccc12
InChI Key InChIKey=ZWMJWQFOQYSJFU-UHFFFAOYSA-N
Data  1 KI
  Tab Delimited (TSV)   2D SDfile   Computed 3D by Vconf -m prep SDfile
Find this compound or compounds like it in BindingDB:
Activity Spreadsheet -- Enzyme Inhibition Constant Data from BindingDB
Found 1 hit for monomerid = 50504081
TargetM-phase inducer phosphatase 2(Homo sapiens (Human))
University Of Naples Federico Ii
Curated by ChEMBL
LigandPNGBDBM50504081(CHEMBL4442999)
Affinity DataKi:  5.10E+3nM. Assay description: Non-competitive inhibition of N-terminal His6-tagged human CDC25B (377 to 550 residues) expressed in Escherichia coli BL21(DE3) cells using OMFP as s...
Ligand InfoPC cidPC sid
In DepthDetails ArticlePubMed