BDBM50504083 CHEBI:34876::CHEMBL170408
SMILES N(c1ccccc1)c1cccc2ccccc12
InChI Key InChIKey=XQVWYOYUZDUNRW-UHFFFAOYSA-N
Data  1 KI
PDB links: 1 PDB ID matches this monomer.
  Tab Delimited (TSV)   2D SDfile   Computed 3D by Vconf -m prep SDfile
Find this compound or compounds like it in BindingDB:
Activity Spreadsheet -- Enzyme Inhibition Constant Data from BindingDB
Found 1 hit for monomerid = 50504083
TargetM-phase inducer phosphatase 2(Homo sapiens (Human))
University Of Naples Federico Ii
Curated by ChEMBL
LigandPNGBDBM50504083(CHEBI:34876 | CHEMBL170408)
Affinity DataKi:  3.20E+4nM. Assay description: Mixed inhibition of N-terminal His6-tagged human CDC25B (377 to 550 residues) expressed in Escherichia coli BL21(DE3) cells using OMFP as substrate b...
In DepthDetails ArticlePubMed