BDBM50504473 CHEMBL1689387
SMILES Clc1ccc(\C=C2/SC(=O)N(CC(=O)Nc3ccccc3)C2=O)c(Cl)c1
InChI Key InChIKey=AZFSGKIBNPQHQD-NVNXTCNLSA-N
Data  2 IC50
  Tab Delimited (TSV)   2D SDfile   Computed 3D by Vconf -m prep SDfile
Find this compound or compounds like it in BindingDB:
Activity Spreadsheet -- Enzyme Inhibition Constant Data from BindingDB
Found 2 hits for monomerid = 50504473
TargetRNA-directed RNA polymerase(Hepatitis C virus)
Cairo University
Curated by ChEMBL
LigandPNGBDBM50504473(CHEMBL1689387)
Affinity DataIC50:  440nM. Assay description: Inhibition of recombinant HCV genotype 1a NS5B polymerase coincubated with HCV international ribosome entry site template sequence containing nucleot...
Ligand InfoPC cidPC sid
In DepthDetails ArticlePubMed
TargetRNA-directed RNA polymerase(Hepatitis C virus)
Cairo University
Curated by ChEMBL
LigandPNGBDBM50504473(CHEMBL1689387)
Affinity DataIC50:  440nM. Assay description: Inhibition of recombinant HCV genotype 1a NS5B polymerase coincubated with HCV international ribosome entry site template sequence containing nucleot...
Ligand InfoPC cidPC sid
In DepthDetails ArticlePubMed