BDBM50504495 CHEMBL1689386
SMILES COc1ccc(\C=C2/SC(=O)N(CC(=O)Nc3ccccc3)C2=O)cc1
InChI Key InChIKey=PAJHHXRPEVAUNX-WJDWOHSUSA-N
Data  2 IC50
  Tab Delimited (TSV)   2D SDfile   Computed 3D by Vconf -m prep SDfile
Find this compound or compounds like it in BindingDB:
Activity Spreadsheet -- Enzyme Inhibition Constant Data from BindingDB
Found 2 hits for monomerid = 50504495
TargetRNA-directed RNA polymerase(Hepatitis C virus)
Cairo University
Curated by ChEMBL
LigandPNGBDBM50504495(CHEMBL1689386)
Affinity DataIC50:  250nM. Assay description: Inhibition of recombinant HCV genotype 1a NS5B polymerase coincubated with HCV international ribosome entry site template sequence containing nucleot...
In DepthDetails ArticlePubMed
TargetRNA-directed RNA polymerase(Hepatitis C virus)
Cairo University
Curated by ChEMBL
LigandPNGBDBM50504495(CHEMBL1689386)
Affinity DataIC50:  250nM. Assay description: Inhibition of recombinant HCV genotype 1a NS5B polymerase coincubated with HCV international ribosome entry site template sequence containing nucleot...
In DepthDetails ArticlePubMed