BDBM50505303 CHEMBL4440542::US11534443, Example 69
SMILES COc1ncc(cc1NS(=O)(=O)c1ccc(F)cc1F)-c1cc(OC(C)C)c2ncnc(C)c2c1
InChI Key InChIKey=TXSXEPQFXLQJNW-UHFFFAOYSA-N
Data  2 IC50
  Tab Delimited (TSV)   2D SDfile   Computed 3D by Vconf -m prep SDfile
Find this compound or compounds like it in BindingDB:
Activity Spreadsheet -- Enzyme Inhibition Constant Data from BindingDB
Found 2 hits for monomerid = 50505303
TargetPhosphatidylinositol 4-phosphate 3-kinase C2 domain-containing subunit alpha(Homo sapiens (Human))
Institute of Materia Medica, Chinese Academy of Medical Sciences
US Patent
LigandPNGBDBM50505303(CHEMBL4440542 | US11534443, Example 69)
Affinity DataIC50:  2.20nM. Assay description: The Kinase-Glo™ Kinase Assay Kit was purchased from Promega. All assays were performed at room temperature using white OptiPlate™-384 well plate. The...
Ligand InfoPC cidPC sid
In DepthDetails US Patent
LigandPNGBDBM50505303(CHEMBL4440542 | US11534443, Example 69)
Affinity DataIC50:  2nM. Assay description: Inhibition of recombinant human N-terminal FLAG-tagged full-length p110alpha/human p85alpha expressed in Sf9 insect cells using PIP2 as substrate by ...
Ligand InfoPC cidPC sid
In DepthDetails ArticlePubMed