BDBM50505520 CHEMBL4515379
SMILES CC[C@H](C)[C@H](NC(=O)C(CO)NC(=O)[C@@H]1CCCN1C(=O)[C@H](CC(C)C)NC(=O)[C@H](Cc1ccc(O)cc1)NC(=O)[C@H](C)NC(=O)[C@H](Cc1cnc[nH]1)NC(=O)[C@H](Cc1cnc[nH]1)NC(=O)[C@H](CC(C)C)NC(=O)[C@@H](NC(=O)[C@@H]1CCCN1C(=O)[C@H](CC(C)C)NC(=O)[C@H](CCC(N)=O)NC(=O)[C@H](Cc1ccc(O)cc1)NC(=O)[C@@H](N)CO)[C@@H](C)CC)C(=O)NCC(=O)NCC(=O)N[C@@H](C(C)C)C(O)=O
InChI Key InChIKey=YWAZIUPRRLQUTC-OFFVXGIUSA-N
Data  1 KI  1 IC50  1 EC50
  Tab Delimited (TSV)   2D SDfile   Computed 3D by Vconf -m prep SDfile
Find this compound or compounds like it in BindingDB:
Activity Spreadsheet -- Enzyme Inhibition Constant Data from BindingDB
Found 3 hits for monomerid = 50505520
TargetBTB/POZ domain-containing protein KCTD12(Homo sapiens)
University Of Copenhagen
Curated by ChEMBL
LigandPNGBDBM50505520(CHEMBL4515379)
Affinity DataKi:  960nM. Assay description: Displacement of TAMRA-AAG-SLQLPILHHAYLPSIGGV from recombinant human 6X His-tagged KCTD12 T1 domain (27 to 131 residues) expressed in Escherichia coli...
Ligand InfoPC cidPC sid
In DepthDetails ArticlePubMed
TargetBTB/POZ domain-containing protein KCTD12(Homo sapiens)
University Of Copenhagen
Curated by ChEMBL
LigandPNGBDBM50505520(CHEMBL4515379)
Affinity DataEC50:  180nM. Assay description: Binding affinity to recombinant human 6X His-tagged KCTD12 T1 domain (27 to 131 residues) expressed in Escherichia coli BL21 DE3 cells preincubated f...
Ligand InfoPC cidPC sid
In DepthDetails ArticlePubMed
TargetBTB/POZ domain-containing protein KCTD12(Homo sapiens)
University Of Copenhagen
Curated by ChEMBL
LigandPNGBDBM50505520(CHEMBL4515379)
Affinity DataIC50:  5.21E+3nM. Assay description: Displacement of TAMRA-AAG-SLQLPILHHAYLPSIGGV from recombinant human 6X His-tagged KCTD12 T1 domain (27 to 131 residues) expressed in Escherichia coli...
Ligand InfoPC cidPC sid
In DepthDetails ArticlePubMed