BDBM50505536 CHEMBL4585960
SMILES CC[C@H](C)[C@H](NC(=O)[C@@H]1CCCN1C(=O)[C@H](Cc1ccc(O)cc1)NC(=O)[C@H](CC(N)=O)NC(=O)[C@H](Cc1ccc(O)cc1)NC(=O)[C@@H](N)CS)C(=O)N[C@@H](CC(C)C)C(=O)N[C@@H](Cc1cnc[nH]1)C(=O)N[C@@H](Cc1cnc[nH]1)C(=O)N[C@@H](C)C(=O)N[C@@H](Cc1ccc(O)cc1)C(=O)N[C@@H](CC(C)C)C(=O)N1CCC[C@H]1C(=O)N[C@@H](CO)C(=O)N[C@@H](CCCNC(N)=N)C(=O)N[C@@H](Cc1cnc[nH]1)C(=O)N[C@@H](Cc1ccc(O)cc1)C(=O)N[C@@H](Cc1ccc(O)cc1)C(O)=O
InChI Key InChIKey=RFAFJUFKTGGXCF-XITBQJDTSA-N
Data  1 KI  1 IC50
  Tab Delimited (TSV)   2D SDfile   Computed 3D by Vconf -m prep SDfile
Find this compound or compounds like it in BindingDB:
Activity Spreadsheet -- Enzyme Inhibition Constant Data from BindingDB
Found 2 hits for monomerid = 50505536
TargetBTB/POZ domain-containing protein KCTD12(Homo sapiens)
University Of Copenhagen
Curated by ChEMBL
LigandPNGBDBM50505536(CHEMBL4585960)
Affinity DataKi:  860nM. Assay description: Displacement of TAMRA-AAG-SLQLPILHHAYLPSIGGV from recombinant human 6X His-tagged KCTD12 T1 domain (27 to 131 residues) expressed in Escherichia coli...
Ligand InfoPC cidPC sid
In DepthDetails ArticlePubMed
TargetBTB/POZ domain-containing protein KCTD12(Homo sapiens)
University Of Copenhagen
Curated by ChEMBL
LigandPNGBDBM50505536(CHEMBL4585960)
Affinity DataIC50:  5.40E+3nM. Assay description: Displacement of TAMRA-AAG-SLQLPILHHAYLPSIGGV from recombinant human 6X His-tagged KCTD12 T1 domain (27 to 131 residues) expressed in Escherichia coli...
Ligand InfoPC cidPC sid
In DepthDetails ArticlePubMed