BDBM50505539 CHEMBL4468344
SMILES CC[C@H](C)[C@H](NC(=O)[C@H](CO)NC(=O)[C@@H]1CCCN1C(=O)[C@H](CC(C)C)NC(=O)[C@H](Cc1ccc(O)cc1)NC(=O)[C@H](C)NC(=O)[C@H](Cc1cnc[nH]1)NC(=O)[C@H](Cc1cnc[nH]1)NC(=O)[C@H](CC(C)C)NC(=O)[C@H](NC(=O)[C@@H]1CCCN1C(=O)[C@H](CC(C)C)NC(=O)[C@H](CCC(N)=O)NC(=O)[C@H](CC(C)C)NC(=O)[C@H](CO)NC(=O)[C@H](CC(C)C)NC(=O)[C@H](CCCNC(N)=N)NC(=O)[C@@H](N)CCCNC(N)=N)[C@@H](C)CC)C(O)=O
InChI Key InChIKey=DUNKHGAACNCRBW-JOSNSTMLSA-N
Data  1 KI  1 Kd
  Tab Delimited (TSV)   2D SDfile   Computed 3D by Vconf -m prep SDfile
Find this compound or compounds like it in BindingDB:
Activity Spreadsheet -- Enzyme Inhibition Constant Data from BindingDB
Found 2 hits for monomerid = 50505539
TargetBTB/POZ domain-containing protein KCTD12(Homo sapiens)
University Of Copenhagen
Curated by ChEMBL
LigandPNGBDBM50505539(CHEMBL4468344)
Affinity DataKi:  1.36E+4nM. Assay description: Displacement of TAMRA-AAG-SLQLPILHHAYLPSIGGV from recombinant human 6X His-tagged KCTD12 T1 domain (27 to 131 residues) expressed in Escherichia coli...
Ligand InfoPC cidPC sid
In DepthDetails ArticlePubMed
TargetBTB/POZ domain-containing protein KCTD12(Homo sapiens)
University Of Copenhagen
Curated by ChEMBL
LigandPNGBDBM50505539(CHEMBL4468344)
Affinity DataKd:  687nM. Assay description: Binding affinity to recombinant human 6X His-tagged KCTD12 T1 domain (27 to 131 residues) expressed in Escherichia coli BL21 DE3 cells assessed as di...
Ligand InfoPC cidPC sid
In DepthDetails ArticlePubMed