BDBM50505675 CHEMBL4440639
SMILES CN1C2N(CCc3ccccc23)Cc2cc(OC(=O)NCCCCCCCCCCN3CCc4ccccc4C3)ccc12
InChI Key InChIKey=UPSLFJVDTFDESY-UHFFFAOYSA-N
Data  2 IC50
  Tab Delimited (TSV)   2D SDfile   Computed 3D by Vconf -m prep SDfile
Find this compound or compounds like it in BindingDB:
Activity Spreadsheet -- Enzyme Inhibition Constant Data from BindingDB
Found 2 hits for monomerid = 50505675
TargetCholinesterase(Homo sapiens (Human))
Julius Maximilian University W£Rzburg
Curated by ChEMBL
LigandPNGBDBM50505675(CHEMBL4440639)
Affinity DataIC50:  42nM. Assay description: Inhibition of human plasma BChE using butyrylthiocholine iodide as substrate preincubated for 20 mins followed by substrate addition and measured aft...
Ligand InfoPC cidPC sid
In DepthDetails ArticlePubMed
TargetCholinesterase(Homo sapiens (Human))
Julius Maximilian University W£Rzburg
Curated by ChEMBL
LigandPNGBDBM50505675(CHEMBL4440639)
Affinity DataIC50:  42nM. Assay description: Inhibition of human plasma BChE using butyrylthiocholine iodide as substrate preincubated for 20 mins followed by substrate addition and measured aft...
Ligand InfoPC cidPC sid
In DepthDetails ArticlePubMed