BDBM50505724 CHEMBL4556539
SMILES COc1ccc(C[C@@H]2NC(=O)[C@H](Cc3ccc(OC)cc3)NC2=O)cc1
InChI Key InChIKey=RZYLWSPICIBIEV-ROUUACIJSA-N
Data  1 Kd
  Tab Delimited (TSV)   2D SDfile   Computed 3D by Vconf -m prep SDfile
Find this compound or compounds like it in BindingDB:
Activity Spreadsheet -- Enzyme Inhibition Constant Data from BindingDB
Found 1 hit for monomerid = 50505724
TargetMycocyclosin synthase(Mycobacterium tuberculosis)
University Of Melbourne
Curated by ChEMBL
LigandPNGBDBM50505724(CHEMBL4556539)
Affinity DataKd:  2.94E+4nM. Assay description: Binding affinity to Mycobacterium tuberculosis CYP121 expressed in Escherichia coli HMS174 (DE3) by UV-visible scanning spectrophotometric analysis
Ligand InfoPC cidPC sid
In DepthDetails ArticlePubMed