BDBM50505738 CHEMBL4565125
SMILES Oc1ccc(C[C@@H]2NC(=O)[C@H](Cc3ccc(O)c(Br)c3)NC2=O)cc1
InChI Key InChIKey=UHZMUUVMCUUKRQ-GJZGRUSLSA-N
Data  1 Kd
PDB links: 1 PDB ID matches this monomer.
  Tab Delimited (TSV)   2D SDfile   Computed 3D by Vconf -m prep SDfile
Find this compound or compounds like it in BindingDB:
Activity Spreadsheet -- Enzyme Inhibition Constant Data from BindingDB
Found 1 hit for monomerid = 50505738
TargetMycocyclosin synthase(Mycobacterium tuberculosis)
University Of Melbourne
Curated by ChEMBL
LigandPNGBDBM50505738(CHEMBL4565125)
Affinity DataKd:  460nM. Assay description: Binding affinity to Mycobacterium tuberculosis His6-tagged CYP121 by UV-visible scanning spectrophotometric analysis
Ligand InfoPC cidPC sidPDB