BDBM50505758 CHEMBL4444489
SMILES Fc1ccc(cc1)-c1ccc([C@H](Cn2ccnc2)NC(=O)c2ccc(cc2)-c2nnc(o2)-c2cc(Br)cc3ccccc23)c(Cl)c1
InChI Key InChIKey=NEOBOHLNNRFVND-XIFFEERXSA-N
Data  2 IC50  1 Kd
  Tab Delimited (TSV)   2D SDfile   Computed 3D by Vconf -m prep SDfile
Find this compound or compounds like it in BindingDB:
Activity Spreadsheet -- Enzyme Inhibition Constant Data from BindingDB
Found 3 hits for monomerid = 50505758
TargetLanosterol 14-alpha demethylase(Homo sapiens (Human))
Vanderbilt University School Of Medicine
Curated by ChEMBL
LigandPNGBDBM50505758(CHEMBL4444489)
Affinity DataIC50: <500nM. Assay description: Inhibition of recombinant full length human CYP51 expressed in Escherichia coli incubated for 1 min using [3H] lanosterol as substrate by HPLC analys...
Ligand InfoPC cidPC sid
In DepthDetails ArticlePubMed
TargetLanosterol 14-alpha demethylase(Homo sapiens (Human))
Vanderbilt University School Of Medicine
Curated by ChEMBL
LigandPNGBDBM50505758(CHEMBL4444489)
Affinity DataIC50:  1.50E+4nM. Assay description: Inhibition of recombinant full length human CYP51 expressed in Escherichia coli incubated for 1 hr using [3H] lanosterol as substrate by HPLC analysi...
Ligand InfoPC cidPC sid
In DepthDetails ArticlePubMed
TargetLanosterol 14-alpha demethylase(Homo sapiens (Human))
Vanderbilt University School Of Medicine
Curated by ChEMBL
LigandPNGBDBM50505758(CHEMBL4444489)
Affinity DataKd:  470nM. Assay description: Binding affinity to recombinant full length human CYP51 expressed in Escherichia coli incubated for 30 sec using [3H] labelled substrate by HPLC anal...
Ligand InfoPC cidPC sid
In DepthDetails ArticlePubMed