BDBM50505942 CHEMBL4470285
SMILES O=C1Nc2cccc(n2)-c2nncn2CCCOc2ccccc12
InChI Key InChIKey=ZWAJXTZDBJPROT-UHFFFAOYSA-N
Data  2 IC50
  Tab Delimited (TSV)   2D SDfile   Computed 3D by Vconf -m prep SDfile
Find this compound or compounds like it in BindingDB:
Activity Spreadsheet -- Enzyme Inhibition Constant Data from BindingDB
Found 2 hits for monomerid = 50505942
TargetMitogen-activated protein kinase kinase kinase 5(Homo sapiens (Human))
TBA
Curated by ChEMBL
LigandPNGBDBM50505942(CHEMBL4470285)
Affinity DataIC50:  6.07E+3nM. Assay description: Inhibition of V5 tagged human ASK1 expressed in HEK-293T cells assessed as reduction in T838 autophosphorylation incubated for 1 hr
Ligand InfoPC cidPC sid
In DepthDetails ArticlePubMed
TargetMitogen-activated protein kinase kinase kinase 5(Homo sapiens (Human))
TBA
Curated by ChEMBL
LigandPNGBDBM50505942(CHEMBL4470285)
Affinity DataIC50:  161nM. Assay description: Inhibition of human ASK1 using myelin basic protein substrate pre-incubated for 20 mins before [33P]-ATP addition and measured after 2 hrs by filter-...
Ligand InfoPC cidPC sid
In DepthDetails ArticlePubMed