BDBM50506126 CHEMBL4525646
SMILES Cc1nc2[nH]c(C3CC3)c(Cc3cccc(Cl)c3)c(=O)n2n1
InChI Key InChIKey=KBXVLCAVBCLNRV-UHFFFAOYSA-N
Data  2 KI
  Tab Delimited (TSV)   2D SDfile   Computed 3D by Vconf -m prep SDfile
Find this compound or compounds like it in BindingDB:
Activity Spreadsheet -- Enzyme Inhibition Constant Data from BindingDB
Found 2 hits for monomerid = 50506126
TargetC-C chemokine receptor type 2(Homo sapiens (Human))
Leiden University
Curated by ChEMBL
LigandPNGBDBM50506126(CHEMBL4525646)
Affinity DataKi:  3.5nM. Assay description: Displacement of [3H]-CCR2-RA-[R] from human CCR2 expressed in human U2OS cells incubated for 2 hrs by scintillation spectrometric method
Ligand InfoPC cidPC sid
In DepthDetails ArticlePubMed
TargetC-C chemokine receptor type 2(Homo sapiens (Human))
Leiden University
Curated by ChEMBL
LigandPNGBDBM50506126(CHEMBL4525646)
Affinity DataKi:  3.5nM. Assay description: Displacement of [3H]-CCR2-RA-[R] from human CCR2 expressed in human U2OS cells incubated for 2 hrs by scintillation spectrometric method
Ligand InfoPC cidPC sid
In DepthDetails ArticlePubMed