BDBM50506139 CHEMBL4466027
SMILES CCC(CC)Cc1[nH]c2nc(N)nn2c(=O)c1Cc1cccc(Cl)c1
InChI Key InChIKey=YFXJTWALCVLVJE-UHFFFAOYSA-N
Data  2 KI
  Tab Delimited (TSV)   2D SDfile   Computed 3D by Vconf -m prep SDfile
Find this compound or compounds like it in BindingDB:
Activity Spreadsheet -- Enzyme Inhibition Constant Data from BindingDB
Found 2 hits for monomerid = 50506139
TargetC-C chemokine receptor type 2(Homo sapiens (Human))
Leiden University
Curated by ChEMBL
LigandPNGBDBM50506139(CHEMBL4466027)
Affinity DataKi:  6.30nM. Assay description: Displacement of [3H]-CCR2-RA-[R] from human CCR2 expressed in human U2OS cells incubated for 2 hrs by scintillation spectrometric method
Ligand InfoPC cidPC sid
In DepthDetails ArticlePubMed
TargetC-C chemokine receptor type 2(Homo sapiens (Human))
Leiden University
Curated by ChEMBL
LigandPNGBDBM50506139(CHEMBL4466027)
Affinity DataKi:  6.40nM. Assay description: Displacement of [3H]-CCR2-RA-[R] from human CCR2 expressed in human U2OS cells incubated for 2 hrs by scintillation spectrometric method
Ligand InfoPC cidPC sid
In DepthDetails ArticlePubMed