BDBM50506558 CHEMBL4566584
SMILES Cl.CC(C)(C)c1cccc(CN(Cc2cccc(NCC(O)=O)n2)S(=O)(=O)c2cccnc2)c1
InChI Key InChIKey=BRCBZWQABRSVFH-UHFFFAOYSA-N
Data  1 EC50
  Tab Delimited (TSV)   2D SDfile   Computed 3D by Vconf -m prep SDfile
Find this compound or compounds like it in BindingDB:
Activity Spreadsheet -- Enzyme Inhibition Constant Data from BindingDB
Found 1 hit for monomerid = 50506558
TargetProstaglandin E2 receptor EP2 subtype(Homo sapiens (Human))
Ube Industries
Curated by ChEMBL
LigandPNGBDBM50506558(CHEMBL4566584)
Affinity DataEC50:  109nM. Assay description: Agonist activity at recombinant human EP2 receptor expressed in HEK293 cells assessed as induction of cAMP accumulation after 30 mins
Ligand InfoPC cidPC sid
In DepthDetails ArticlePubMed