BDBM50506860 CHEMBL4524233
SMILES O[C@H]1C(Cc2ccccc2)(Cc2ccccc2)CCC[C@@]11Cc2cnn(c2C=C1)-c1ccc(F)cc1
InChI Key InChIKey=RNFUQVUWPZLHNK-FIRIVFDPSA-N
Data  1 IC50
  Tab Delimited (TSV)   2D SDfile   Computed 3D by Vconf -m prep SDfile
Find this compound or compounds like it in BindingDB:
Activity Spreadsheet -- Enzyme Inhibition Constant Data from BindingDB
Found 1 hit for monomerid = 50506860
TargetGlucocorticoid receptor(Homo sapiens (Human))
European Institute Of Chemistry And Biology (Iecb)
Curated by ChEMBL
LigandPNGBDBM50506860(CHEMBL4524233)
Affinity DataIC50: >1.00E+3nM. Assay description: Displacement of [3H]dexamethasone from GR in human IM9 cells after 6 hrs by scintillation counting method
Ligand InfoPC cidPC sid
In DepthDetails ArticlePubMed