BDBM50507154 CHEMBL4533174
SMILES CC(=O)C1=C(O)C=C2Oc3c(c(O)c(C)c(O)c3-c3csc(N\N=C\c4ccc(O)cc4)n3)[C@@]2(C)C1=O
InChI Key InChIKey=JIPBFDCIWQEBCX-CNRPVLOSSA-N
Data  1 IC50  1 Kd
  Tab Delimited (TSV)   2D SDfile   Computed 3D by Vconf -m prep SDfile
Find this compound or compounds like it in BindingDB:
Activity Spreadsheet -- Enzyme Inhibition Constant Data from BindingDB
Found 2 hits for monomerid = 50507154
TargetTyrosyl-DNA phosphodiesterase 1(Homo sapiens (Human))
Siberian Branch Of The Russian Academy Of Sciences
Curated by ChEMBL
LigandPNGBDBM50507154(CHEMBL4533174)
Affinity DataIC50:  457nM. Assay description: Inhibition of recombinant human full-length N-terminal His-tagged Tdp1 expressed in Escherichia coli BL21 (DE3) using 5'-(5,6 FAM-aac gtc agg gtc ttc...
Ligand InfoPC cidPC sid
In DepthDetails ArticlePubMed
TargetTyrosyl-DNA phosphodiesterase 1(Homo sapiens (Human))
Siberian Branch Of The Russian Academy Of Sciences
Curated by ChEMBL
LigandPNGBDBM50507154(CHEMBL4533174)
Affinity DataKd:  3.11E+4nM. Assay description: Binding affinity to recombinant human Tdp1 (149 to 608 residues) expressed in Escherichia coli BL21 (DE3) by tryptophan fluorescence quenching assay
Ligand InfoPC cidPC sid
In DepthDetails ArticlePubMed