BDBM50507707 CHEMBL4466555
SMILES Cc1ccc(cc1NC(=O)C1(CC1)c1ncnc2[nH]cnc12)C(=O)Nc1ccc(Cl)c(c1)C(F)(F)F
InChI Key InChIKey=YXARVHZXTQVAOP-UHFFFAOYSA-N
Data  12 IC50
  Tab Delimited (TSV)   2D SDfile   Computed 3D by Vconf -m prep SDfile
Find this compound or compounds like it in BindingDB:
Activity Spreadsheet -- Enzyme Inhibition Constant Data from BindingDB
Found 12 hits for monomerid = 50507707
TargetTyrosine-protein kinase Lck(Homo sapiens (Human))
China Pharmaceutical University
Curated by ChEMBL
LigandPNGBDBM50507707(CHEMBL4466555)
Affinity DataIC50:  41nM. Assay description: Inhibition of human LCK using poly[Glu:Tyr] (4:1) as substrate by [gamma-33P]-ATP assay
Ligand InfoPC cidPC sid
In DepthDetails ArticlePubMed
TargetEpithelial discoidin domain-containing receptor 1(Homo sapiens (Human))
China Pharmaceutical University
Curated by ChEMBL
LigandPNGBDBM50507707(CHEMBL4466555)
Affinity DataIC50:  3nM. Assay description: Inhibition of human DDR1 using KKSRGDYMTMQIG as substrate by [gamma-33P]-ATP assay
Ligand InfoPC cidPC sid
In DepthDetails ArticlePubMed
TargetDiscoidin domain-containing receptor 2(Homo sapiens (Human))
China Pharmaceutical University
Curated by ChEMBL
LigandPNGBDBM50507707(CHEMBL4466555)
Affinity DataIC50:  2.60nM. Assay description: Inhibition of human DDR2 using KKSRGDYMTMQIG as substrate by [gamma-33P]-ATP assay
Ligand InfoPC cidPC sid
In DepthDetails ArticlePubMed
TargetMacrophage colony-stimulating factor 1 receptor(Homo sapiens (Human))
China Pharmaceutical University
Curated by ChEMBL
LigandPNGBDBM50507707(CHEMBL4466555)
Affinity DataIC50:  3.90nM. Assay description: Inhibition of human FMS using poly[Glu:Tyr] (4:1) as substrate by [gamma-33P]-ATP assay
Ligand InfoPC cidPC sid
In DepthDetails ArticlePubMed
TargetPlatelet-derived growth factor receptor beta(Homo sapiens (Human))
China Pharmaceutical University
Curated by ChEMBL
LigandPNGBDBM50507707(CHEMBL4466555)
Affinity DataIC50:  25nM. Assay description: Inhibition of human PDGFRbeta using poly[Glu:Tyr] (4:1) as substrate by [gamma-33P]-ATP assay
Ligand InfoPC cidPC sid
In DepthDetails ArticlePubMed
TargetSerine/threonine-protein kinase B-raf(Homo sapiens (Human))
China Pharmaceutical University
Curated by ChEMBL
LigandPNGBDBM50507707(CHEMBL4466555)
Affinity DataIC50:  1nM. Assay description: Inhibition of human BRAF using MEK1 (K97R) as substrate by [gamma-33P]-ATP assay
Ligand InfoPC cidPC sid
In DepthDetails ArticlePubMed
TargetRAF proto-oncogene serine/threonine-protein kinase(Homo sapiens (Human))
China Pharmaceutical University
Curated by ChEMBL
LigandPNGBDBM50507707(CHEMBL4466555)
Affinity DataIC50:  0.5nM. Assay description: Inhibition of human cRAF using MEK1 (K97R) as substrate by [gamma-33P]-ATP assay
Ligand InfoPC cidPC sid
In DepthDetails ArticlePubMed
TargetEphrin type-A receptor 2(Homo sapiens (Human))
China Pharmaceutical University
Curated by ChEMBL
LigandPNGBDBM50507707(CHEMBL4466555)
Affinity DataIC50:  14nM. Assay description: Inhibition of human EPHA2 using poly[Glu:Tyr] (4:1) as substrate by [gamma-33P]-ATP assay
Ligand InfoPC cidPC sid
In DepthDetails ArticlePubMed
TargetProto-oncogene tyrosine-protein kinase receptor Ret(Homo sapiens (Human))
China Pharmaceutical University
Curated by ChEMBL
LigandPNGBDBM50507707(CHEMBL4466555)
Affinity DataIC50:  5.20nM. Assay description: Inhibition of human RET using KKKVSRSGLYRSPSMPENLNRPR as substrate by [gamma-33P]-ATP assay
Ligand InfoPC cidPC sid
In DepthDetails ArticlePubMed
TargetFibroblast growth factor receptor 2(Homo sapiens (Human))
China Pharmaceutical University
Curated by ChEMBL
LigandPNGBDBM50507707(CHEMBL4466555)
Affinity DataIC50:  39nM. Assay description: Inhibition of human FGFR2 using poly[Glu:Tyr] (4:1) as substrate by [gamma-33P]-ATP assay
Ligand InfoPC cidPC sid
In DepthDetails ArticlePubMed
TargetSerine/threonine-protein kinase A-Raf(Homo sapiens (Human))
China Pharmaceutical University
Curated by ChEMBL
LigandPNGBDBM50507707(CHEMBL4466555)
Affinity DataIC50:  1nM. Assay description: Inhibition of human ARAF using MEK1 as substrate by [gamma-33P]-ATP assay
Ligand InfoPC cidPC sid
In DepthDetails ArticlePubMed
TargetSerine/threonine-protein kinase B-raf(Homo sapiens (Human))
China Pharmaceutical University
Curated by ChEMBL
LigandPNGBDBM50507707(CHEMBL4466555)
Affinity DataIC50:  1.90nM. Assay description: Inhibition of human BRAF V600E mutant using MEK1 (K97R) as substrate by [gamma-33P]-ATP assay
Ligand InfoPC cidPC sid
In DepthDetails ArticlePubMed