BDBM50508293 Doravirine::MK-1439::Pifeltro
SMILES Cn1c(Cn2ccc(c(Oc3cc(Cl)cc(c3)C#N)c2=O)C(F)(F)F)n[nH]c1=O
InChI Key InChIKey=ZIAOVIPSKUPPQW-UHFFFAOYSA-N
Data  3 IC50
PDB links: 3 PDB IDs match this monomer.
  Tab Delimited (TSV)   2D SDfile   Computed 3D by Vconf -m prep SDfile
Find this compound or compounds like it in BindingDB:
Activity Spreadsheet -- Enzyme Inhibition Constant Data from BindingDB
Found 1 hit for monomerid = 50508293
TargetReverse transcriptase(Human immunodeficiency virus 1)
Shandong University
Curated by ChEMBL
LigandPNGBDBM50508293(Doravirine | MK-1439 | Pifeltro)
Affinity DataIC50:  19nM. Assay description: Inhibition of recombinant wild type HIV1 reverse transcriptase assessed as reduction in biotin-dUTP incorporation using poly(A)/oligo(dT)15 as templa...
In DepthDetails ArticlePubMed