BDBM50509008 CHEMBL4461151
SMILES N[C@]1(CN(Cc2cncs2)C[C@@H]1CCCB(O)O)C(O)=O
InChI Key InChIKey=RGWXZLOWCFYEFK-CABZTGNLSA-N
Data  1 IC50
  Tab Delimited (TSV)   2D SDfile   Computed 3D by Vconf -m prep SDfile
Find this compound or compounds like it in BindingDB:
Activity Spreadsheet -- Enzyme Inhibition Constant Data from BindingDB
Found 1 hit for monomerid = 50509008
TargetArginase-1(Homo sapiens (Human))
New England Discovery Partners
Curated by ChEMBL
LigandPNGBDBM50509008(CHEMBL4461151)
Affinity DataIC50:  360nM. Assay description: Inhibition of human recombinant arginase 1 expressed in Escherichia coli BL21 (DE3) assessed as reduction in urea production using L-arginine as subs...
Ligand InfoPC cidPC sid
In DepthDetails ArticlePubMed