BDBM50509508 CHEMBL4534768
SMILES OC(=O)C(F)(F)F.OC(=O)C(F)(F)F.OC(=O)C(F)(F)F.[O-]C(=O)C(F)(F)F.CC[C@H](C)[C@H](NC(=O)[C@H](Cc1ccc(O)cc1)NC(=O)[C@@H]1CCCN1C(=O)[C@H](CCCNC(N)=N)NC(=O)[C@@H](N)CCCNC(=N)NC(=O)NCCOCCOCCNC(=O)CCCCCN1\C(=C\C=C\C=C\C2=[N+](C)c3ccccc3C2(C)C)C(C)(C)c2ccccc12)C(=O)N[C@@H](CC(C)C)C(O)=O
InChI Key InChIKey=ASLFEYYVCFLUPC-OXMRCNJYSA-N
Data  3 KI  2 Kd
  Tab Delimited (TSV)   2D SDfile   Computed 3D by Vconf -m prep SDfile
Find this compound or compounds like it in BindingDB:
Activity Spreadsheet -- Enzyme Inhibition Constant Data from BindingDB
Found 5 hits for monomerid = 50509508
TargetNeurotensin receptor type 2(Homo sapiens (Human))
University Of Regensburg
Curated by ChEMBL
LigandPNGBDBM50509508(CHEMBL4534768)
Affinity DataKi:  0.955nM. Assay description: Displacement of [3H] UR-MK300 from human neurotensin receptor 2 in HEK293 cells homogenate incubated in dark after 30 mins by liquid scintillation co...
Ligand InfoPC cidPC sid
In DepthDetails ArticlePubMed
TargetNeurotensin receptor type 1(Homo sapiens (Human))
University Of Regensburg
Curated by ChEMBL
LigandPNGBDBM50509508(CHEMBL4534768)
Affinity DataKi:  2.20nM. Assay description: Displacement of [3H] UR-MK300 from human neurotensin receptor 1 expressed in HT-29 cells incubated in dark after 30 mins by liquid scintillation coun...
Ligand InfoPC cidPC sid
In DepthDetails ArticlePubMed
TargetNeurotensin receptor type 1(Homo sapiens (Human))
University Of Regensburg
Curated by ChEMBL
LigandPNGBDBM50509508(CHEMBL4534768)
Affinity DataKi:  2.5nM. Assay description: Displacement of [3H] UR-MK300 from human neurotensin receptor 1 stably expressed in CHO cells incubated in dark after 30 mins by liquid scintillation...
Ligand InfoPC cidPC sid
In DepthDetails ArticlePubMed
TargetNeurotensin receptor type 1(Homo sapiens (Human))
University Of Regensburg
Curated by ChEMBL
LigandPNGBDBM50509508(CHEMBL4534768)
Affinity DataKd:  2.5nM. Assay description: Binding affinity to human neurotensin receptor 1 stably expressed in CHO cells incubated for 75 mins in presence of NT (8 to 13) followed by compound...
Ligand InfoPC cidPC sid
In DepthDetails ArticlePubMed
TargetNeurotensin receptor type 1(Homo sapiens (Human))
University Of Regensburg
Curated by ChEMBL
LigandPNGBDBM50509508(CHEMBL4534768)
Affinity DataKd:  10nM. Assay description: Binding affinity to human neurotensin receptor 1 stably expressed in CHO cells incubated for 60 mins in presence of NT (8 to 13) without compound was...
Ligand InfoPC cidPC sid
In DepthDetails ArticlePubMed