BDBM50509607 CHEMBL4465394
SMILES O=C(NC1CCN(CC1)S(=O)(=O)C[C@H]1CC[C@@H](CC1)NCc1ccccc1)c1cc(on1)C1CC1
InChI Key InChIKey=SQGOVOAUUGBLLJ-AQYVVDRMSA-N
Data  1 IC50  1 EC50
  Tab Delimited (TSV)   2D SDfile   Computed 3D by Vconf -m prep SDfile
Find this compound or compounds like it in BindingDB:
Activity Spreadsheet -- Enzyme Inhibition Constant Data from BindingDB
Found 2 hits for monomerid = 50509607
TargetHistone-lysine N-methyltransferase SMYD3(Homo sapiens (Human))
Glaxosmithkline
Curated by ChEMBL
LigandPNGBDBM50509607(CHEMBL4465394)
Affinity DataIC50: <1nM. Assay description: Inhibition of recombinant N-terminal FLAG/His-tagged SMYD3 (unknown origin) expressed in baculovirus infected insect cells using 3H-SAM as substrate ...
Ligand InfoPC cidPC sid
In DepthDetails ArticlePubMed
TargetHistone-lysine N-methyltransferase SMYD3(Homo sapiens (Human))
Glaxosmithkline
Curated by ChEMBL
LigandPNGBDBM50509607(CHEMBL4465394)
Affinity DataEC50:  22nM. Assay description: Inhibition of recombinant SMYD3 (unknown origin) transfected in human HEK293 cells assessed as reduction in MEKK2 methylation incubated for 24 hrs by...
Ligand InfoPC cidPC sid
In DepthDetails ArticlePubMed