BDBM50509616 CHEMBL4452997
SMILES CN(CCCC(F)(F)F)[C@H]1CC[C@H](CS(=O)(=O)N2CCC(CC2)NC(=O)c2cc(on2)C2CC2)CC1
InChI Key InChIKey=YRSVLSCPNHQEEK-IRJFHVNHSA-N
Data  1 IC50  1 EC50
  Tab Delimited (TSV)   2D SDfile   Computed 3D by Vconf -m prep SDfile
Find this compound or compounds like it in BindingDB:
Activity Spreadsheet -- Enzyme Inhibition Constant Data from BindingDB
Found 2 hits for monomerid = 50509616
TargetHistone-lysine N-methyltransferase SMYD3(Homo sapiens (Human))
Glaxosmithkline
Curated by ChEMBL
LigandPNGBDBM50509616(CHEMBL4452997)
Affinity DataEC50:  261nM. Assay description: Inhibition of recombinant SMYD3 (unknown origin) transfected in human HEK293 cells assessed as reduction in MEKK2 methylation incubated for 24 hrs by...
Ligand InfoPC cidPC sid
In DepthDetails ArticlePubMed
TargetHistone-lysine N-methyltransferase SMYD3(Homo sapiens (Human))
Glaxosmithkline
Curated by ChEMBL
LigandPNGBDBM50509616(CHEMBL4452997)
Affinity DataIC50: <1nM. Assay description: Inhibition of recombinant N-terminal FLAG/His-tagged SMYD3 (unknown origin) expressed in baculovirus infected insect cells using 3H-SAM as substrate ...
Ligand InfoPC cidPC sid
In DepthDetails ArticlePubMed