BDBM50510161 CHEMBL4576509
SMILES CN1CCOc2c1cnn1c(nnc21)-c1ccc2cccc(NCC3(F)CCNCC3)c2n1
InChI Key InChIKey=HVQKSMUBAKDZPC-UHFFFAOYSA-N
Data  5 IC50  1 EC50
  Tab Delimited (TSV)   2D SDfile   Computed 3D by Vconf -m prep SDfile
Find this compound or compounds like it in BindingDB:
Activity Spreadsheet -- Enzyme Inhibition Constant Data from BindingDB
Found 6 hits for monomerid = 50510161
TargetSerine/threonine-protein kinase pim-1(Homo sapiens (Human))
Spanish National Cancer Research Centre (Cnio)
Curated by ChEMBL
LigandPNGBDBM50510161(CHEMBL4576509)
Affinity DataIC50:  21nM. Assay description: Inhibition of His tagged human recombinant PIM1 using PIM tide (ARKRRRHPSGPPTA) as substrate incubated for 1 hr by fluorescence based assay
Ligand InfoPC cidPC sid
In DepthDetails ArticlePubMed
TargetPotassium voltage-gated channel subfamily H member 2(Homo sapiens (Human))
Spanish National Cancer Research Centre (Cnio)
Curated by ChEMBL
LigandPNGBDBM50510161(CHEMBL4576509)
Affinity DataIC50:  1.97E+4nM. Assay description: Inhibition of human ERG incubated for 1 hr by Fluorescence polarization binding assay
Ligand InfoPC cidPC sid
In DepthDetails ArticlePubMed
TargetSerine/threonine-protein kinase pim-2(Homo sapiens (Human))
Spanish National Cancer Research Centre (Cnio)
Curated by ChEMBL
LigandPNGBDBM50510161(CHEMBL4576509)
Affinity DataIC50:  5.53E+3nM. Assay description: Inhibition of His tagged human recombinant PIM2 using PIM tide (ARKRRRHPSGPPTA) as substrate incubated for 1 hr by fluorescence based assay
Ligand InfoPC cidPC sid
In DepthDetails ArticlePubMed
TargetReceptor-type tyrosine-protein kinase FLT3(Homo sapiens (Human))
Spanish National Cancer Research Centre (Cnio)
Curated by ChEMBL
LigandPNGBDBM50510161(CHEMBL4576509)
Affinity DataIC50: >1.00E+4nM. Assay description: Inhibition of human FLT3 using EAIYAAPFAKKK as substrate incubated for 60 mins by fluorescence based assay
Ligand InfoPC cidPC sid
In DepthDetails ArticlePubMed
TargetSerine/threonine-protein kinase pim-3(Homo sapiens (Human))
Spanish National Cancer Research Centre (Cnio)
Curated by ChEMBL
LigandPNGBDBM50510161(CHEMBL4576509)
Affinity DataIC50:  55nM. Assay description: Inhibition of N-terminal 6-His tagged human recombinant PIM3 using PIM tide (ARKRRRHPSGPPTA) as substrate incubated for 1 hr by fluorescence based as...
Ligand InfoPC cidPC sid
In DepthDetails ArticlePubMed
TargetSerine/threonine-protein kinase pim-1(Homo sapiens (Human))
Spanish National Cancer Research Centre (Cnio)
Curated by ChEMBL
LigandPNGBDBM50510161(CHEMBL4576509)
Affinity DataEC50:  215nM. Assay description: Inhibition of PIM1 in human NCI-H1299 cells assessed as reduction in BAD phosphorylation at Ser-112 residue incubated for 4 hrs by ELISA
Ligand InfoPC cidPC sid
In DepthDetails ArticlePubMed