BDBM50510186 CHEMBL4577938
SMILES CN1CCOc2c1cnn1c(nnc21)-c1ccc2cccc(NCC3CCNCC3)c2n1
InChI Key InChIKey=WFPLKANBSQGCJH-UHFFFAOYSA-N
Data  3 IC50  1 EC50
  Tab Delimited (TSV)   2D SDfile   Computed 3D by Vconf -m prep SDfile
Find this compound or compounds like it in BindingDB:
Activity Spreadsheet -- Enzyme Inhibition Constant Data from BindingDB
Found 4 hits for monomerid = 50510186
TargetSerine/threonine-protein kinase pim-2(Homo sapiens (Human))
Spanish National Cancer Research Centre (Cnio)
Curated by ChEMBL
LigandPNGBDBM50510186(CHEMBL4577938)
Affinity DataIC50:  4.26E+3nM. Assay description: Inhibition of His tagged human recombinant PIM2 using PIM tide (ARKRRRHPSGPPTA) as substrate incubated for 1 hr by fluorescence based assay
Ligand InfoPC cidPC sid
In DepthDetails ArticlePubMed
TargetSerine/threonine-protein kinase pim-3(Homo sapiens (Human))
Spanish National Cancer Research Centre (Cnio)
Curated by ChEMBL
LigandPNGBDBM50510186(CHEMBL4577938)
Affinity DataIC50:  17nM. Assay description: Inhibition of N-terminal 6-His tagged human recombinant PIM3 using PIM tide (ARKRRRHPSGPPTA) as substrate incubated for 1 hr by fluorescence based as...
Ligand InfoPC cidPC sid
In DepthDetails ArticlePubMed
TargetSerine/threonine-protein kinase pim-1(Homo sapiens (Human))
Spanish National Cancer Research Centre (Cnio)
Curated by ChEMBL
LigandPNGBDBM50510186(CHEMBL4577938)
Affinity DataEC50:  700nM. Assay description: Inhibition of PIM1 in human NCI-H1299 cells assessed as reduction in BAD phosphorylation at Ser-112 residue incubated for 4 hrs by ELISA
Ligand InfoPC cidPC sid
In DepthDetails ArticlePubMed
TargetSerine/threonine-protein kinase pim-1(Homo sapiens (Human))
Spanish National Cancer Research Centre (Cnio)
Curated by ChEMBL
LigandPNGBDBM50510186(CHEMBL4577938)
Affinity DataIC50:  14nM. Assay description: Inhibition of His tagged human recombinant PIM1 using PIM tide (ARKRRRHPSGPPTA) as substrate incubated for 1 hr by fluorescence based assay
Ligand InfoPC cidPC sid
In DepthDetails ArticlePubMed