BDBM50510366 CHEMBL4459257
SMILES COc1ccc(cc1)S(=O)(=O)N1CCc2c(C1)sc1ncnc(Nc3ccc(Cl)cc3F)c21
InChI Key InChIKey=AYFYQTGHNPJBQW-UHFFFAOYSA-N
Data  1 IC50
  Tab Delimited (TSV)   2D SDfile   Computed 3D by Vconf -m prep SDfile
Find this compound or compounds like it in BindingDB:
Activity Spreadsheet -- Enzyme Inhibition Constant Data from BindingDB
Found 1 hit for monomerid = 50510366
TargetMAP kinase-interacting serine/threonine-protein kinase 1(Homo sapiens (Human))
Chengdu Medical College
Curated by ChEMBL
LigandPNGBDBM50510366(CHEMBL4459257)
Affinity DataIC50:  1.15E+3nM. Assay description: Inhibition of human MNK1 using CREBtide substrate by gamma-[32P]-ATP competitive inhibition assay
Ligand InfoPC cidPC sid
In DepthDetails ArticlePubMed