BDBM50510411 CHEMBL4463661
SMILES Fc1ccc(c(F)c1)S(=O)(=O)N1CCc2c(C1)sc1ncnc(Nc3ccc(Cl)cc3)c21
InChI Key InChIKey=DHSYELGFVCMALV-UHFFFAOYSA-N
Data  1 IC50
  Tab Delimited (TSV)   2D SDfile   Computed 3D by Vconf -m prep SDfile
Find this compound or compounds like it in BindingDB:
Activity Spreadsheet -- Enzyme Inhibition Constant Data from BindingDB
Found 1 hit for monomerid = 50510411
TargetMAP kinase-interacting serine/threonine-protein kinase 1(Homo sapiens (Human))
Chengdu Medical College
Curated by ChEMBL
LigandPNGBDBM50510411(CHEMBL4463661)
Affinity DataIC50:  1.50E+3nM. Assay description: Inhibition of human MNK1 using CREBtide substrate by gamma-[32P]-ATP competitive inhibition assay
Ligand InfoPC cidPC sid
In DepthDetails ArticlePubMed