BDBM50510952 CHEMBL4474734
SMILES Fc1ccc(c(F)c1)S(=O)(=O)Nc1cncc(c1)-c1ccc(s1)-c1ccc2C(=O)N(CCN3CCCCC3)Cc2c1
InChI Key InChIKey=LPLNWOWXFYUPNA-UHFFFAOYSA-N
Data  1 IC50
  Tab Delimited (TSV)   2D SDfile   Computed 3D by Vconf -m prep SDfile
Find this compound or compounds like it in BindingDB:
Activity Spreadsheet -- Enzyme Inhibition Constant Data from BindingDB
Found 1 hit for monomerid = 50510952
TargetPerforin-1(Homo sapiens (Human))
University Of Auckland
Curated by ChEMBL
LigandPNGBDBM50510952(CHEMBL4474734)
Affinity DataIC50: >2.00E+4nM. Assay description: Inhibition of perforin (unknown origin) assessed as reduction in perforin-mediated cell lysis in human Jurkat T cells incubated for 30 mins by 51Cr r...
Ligand InfoPC cidPC sid
In DepthDetails ArticlePubMed