BDBM50510957 CHEMBL4536876
SMILES CN1Cc2cc(cnc2C1=O)-c1ccc(s1)-c1cncc(NS(=O)(=O)c2ccccc2C(F)(F)F)c1
InChI Key InChIKey=DPVNAXKVMPQQOT-UHFFFAOYSA-N
Data  2 IC50
  Tab Delimited (TSV)   2D SDfile   Computed 3D by Vconf -m prep SDfile
Find this compound or compounds like it in BindingDB:
Activity Spreadsheet -- Enzyme Inhibition Constant Data from BindingDB
Found 2 hits for monomerid = 50510957
TargetPerforin-1(Homo sapiens (Human))
University Of Auckland
Curated by ChEMBL
LigandPNGBDBM50510957(CHEMBL4536876)
Affinity DataIC50:  1.38E+3nM. Assay description: Inhibition of perforin (unknown origin) assessed as reduction in perforin-mediated cell lysis in human Jurkat T cells incubated for 30 mins by 51Cr r...
Ligand InfoPC cidPC sid
In DepthDetails ArticlePubMed
TargetPerforin-1(Homo sapiens (Human))
University Of Auckland
Curated by ChEMBL
LigandPNGBDBM50510957(CHEMBL4536876)
Affinity DataIC50:  3.30E+3nM. Assay description: Inhibition of perforin in human KHYG-1 cells pre-treated with compound for 20 mins assessed as reduction in KHYG-1 cells-mediated cell lysis of human...
Ligand InfoPC cidPC sid
In DepthDetails ArticlePubMed