BDBM50510960 CHEMBL4594019
SMILES CN(C)CCN1Cc2cc(ccc2C1=O)-c1ccc(s1)-c1cncc(NS(=O)(=O)c2ccc(F)cc2F)c1
InChI Key InChIKey=VWGSDSSHJASNKM-UHFFFAOYSA-N
Data  1 IC50
  Tab Delimited (TSV)   2D SDfile   Computed 3D by Vconf -m prep SDfile
Find this compound or compounds like it in BindingDB:
Activity Spreadsheet -- Enzyme Inhibition Constant Data from BindingDB
Found 1 hit for monomerid = 50510960
TargetPerforin-1(Homo sapiens (Human))
University Of Auckland
Curated by ChEMBL
LigandPNGBDBM50510960(CHEMBL4594019)
Affinity DataIC50: >2.00E+4nM. Assay description: Inhibition of perforin (unknown origin) assessed as reduction in perforin-mediated cell lysis in human Jurkat T cells incubated for 30 mins by 51Cr r...
Ligand InfoPC cidPC sid
In DepthDetails ArticlePubMed