BDBM50510978 CHEMBL4539909
SMILES [H][C@@]12C[C@]1(CF)SC(N)=N[C@]2(C)c1cc(NC(=O)c2ccc(Cl)cn2)cc(F)c1F
InChI Key InChIKey=UKZKWTZATFOTDT-GDIGMMSISA-N
Data  4 IC50
  Tab Delimited (TSV)   2D SDfile   Computed 3D by Vconf -m prep SDfile
Find this compound or compounds like it in BindingDB:
Activity Spreadsheet -- Enzyme Inhibition Constant Data from BindingDB
Found 4 hits for monomerid = 50510978
TargetBeta-secretase 2(Homo sapiens (Human))
TBA
Curated by ChEMBL
LigandPNGBDBM50510978(CHEMBL4539909)
Affinity DataIC50: <2nM. Assay description: Inhibition of BACE2 (unknown origin) using FRET peptide substrate preincubated for 1 hr followed by substrate addition and measured after 1 hr by FRE...
Ligand InfoPC cidPC sid
In DepthDetails ArticlePubMed
TargetCathepsin D(Homo sapiens (Human))
TBA
Curated by ChEMBL
LigandPNGBDBM50510978(CHEMBL4539909)
Affinity DataIC50:  4.25E+5nM. Assay description: Inhibition of recombinant CatD (unknown origin) expressed in CHO cells using FRET peptide substrate preincubated for 1 hr followed by substrate addit...
Ligand InfoPC cidPC sid
In DepthDetails ArticlePubMed
TargetBeta-secretase 1(Homo sapiens (Human))
TBA
Curated by ChEMBL
LigandPNGBDBM50510978(CHEMBL4539909)
Affinity DataIC50:  1.30nM. Assay description: Inhibition of BACE1 (unknown origin) using FRET peptide substrate preincubated for 1 hr followed by substrate addition and measured after 1 hr by FRE...
Ligand InfoPC cidPC sid
In DepthDetails ArticlePubMed
TargetBeta-secretase 1(Homo sapiens (Human))
TBA
Curated by ChEMBL
LigandPNGBDBM50510978(CHEMBL4539909)
Affinity DataIC50:  2.40nM. Assay description: Inhibition of BACE in HEK293 cells harboring APP Swedish mutant assessed as reduction in amyloid beta 40 level measured after overnight incubation by...
Ligand InfoPC cidPC sid
In DepthDetails ArticlePubMed