BDBM50511020 CHEMBL4568775
SMILES CCCCCCCCN(C)c1cc(=O)[nH]c(=O)[nH]1
InChI Key InChIKey=LENHIXFSYQFBKO-UHFFFAOYSA-N
Data  1 KI
  Tab Delimited (TSV)   2D SDfile   Computed 3D by Vconf -m prep SDfile
Find this compound or compounds like it in BindingDB:
Activity Spreadsheet -- Enzyme Inhibition Constant Data from BindingDB
Found 1 hit for monomerid = 50511020
TargetG-protein coupled receptor 84(Homo sapiens (Human))
University Of Bonn
Curated by ChEMBL
LigandPNGBDBM50511020(CHEMBL4568775)
Affinity DataKi:  3.60nM. Assay description: Displacement of [3H]PSB-1584 from recombinant human GPR84 expressed in CHO cell membranes co-expressing beta-arrestin2 measured after 6 hrs by scinti...
Ligand InfoPC cidPC sid
In DepthDetails ArticlePubMed