BDBM50511036 CHEMBL4574715
SMILES CCCCCCCNc1[nH]c(=O)[nH]c(=O)c1N=O
InChI Key InChIKey=QDUFQFALJUPTAL-UHFFFAOYSA-N
Data  1 KI
  Tab Delimited (TSV)   2D SDfile   Computed 3D by Vconf -m prep SDfile
Find this compound or compounds like it in BindingDB:
Activity Spreadsheet -- Enzyme Inhibition Constant Data from BindingDB
Found 1 hit for monomerid = 50511036
TargetG-protein coupled receptor 84(Homo sapiens (Human))
University Of Bonn
Curated by ChEMBL
LigandPNGBDBM50511036(CHEMBL4574715)
Affinity DataKi:  59nM. Assay description: Displacement of [3H]PSB-1584 from recombinant human GPR84 expressed in CHO cell membranes co-expressing beta-arrestin2 measured after 6 hrs by scinti...
Ligand InfoPC cidPC sid
In DepthDetails ArticlePubMed