BDBM50512236 CHEMBL4535163
SMILES COC(=O)c1sc2nc3c(C)cc(C)cc3cc2c1N
InChI Key InChIKey=YVNDCZIAPNBGIC-UHFFFAOYSA-N
Data  1 IC50
  Tab Delimited (TSV)   2D SDfile   Computed 3D by Vconf -m prep SDfile
Find this compound or compounds like it in BindingDB:
Activity Spreadsheet -- Enzyme Inhibition Constant Data from BindingDB
Found 1 hit for monomerid = 50512236
TargetUrea transporter 1(Rattus norvegicus (Rat))
Peking University
Curated by ChEMBL
LigandPNGBDBM50512236(CHEMBL4535163)
Affinity DataIC50:  610nM. Assay description: Inhibition of urea transporter B in Sprague-Dawley rat erythrocytes incubated for 6 mins by spectrophotometric analysis based erythrocyte lysis assay
Ligand InfoPC cidPC sid
In DepthDetails ArticlePubMed