BDBM505127 US11066409, Compound I-0100
SMILES Cc1nc2cc(C)c(Nc3nc(=O)cc4NCC(c5ccccc5)n34)cc2s1
InChI Key InChIKey=GTTKCLGVHDHSAG-UHFFFAOYSA-N
Data  1 IC50
  Tab Delimited (TSV)   2D SDfile   Computed 3D by Vconf -m prep SDfile
Find this compound or compounds like it in BindingDB:
Activity Spreadsheet -- Enzyme Inhibition Constant Data from BindingDB
Found 1 hit for monomerid = 505127
TargetP2X purinoceptor 7(Homo sapiens (Human))
Shionogi
US Patent
LigandPNGBDBM505127(US11066409, Compound I-0100)
Affinity DataIC50:  12nM. Assay description: Evaluation of a human P2X7 receptor inhibitory activity Stably expressing cell line (1321N1 cell transfected with the human P2X7 receptor gene (GenBa...
Ligand InfoPC cidPC sid
In DepthDetails US Patent