BDBM50513517 CHEMBL4577011
SMILES Clc1ccc(CCNCc2c(nc3sccn23)-c2ccc(Br)cc2)cc1Cl
InChI Key InChIKey=NGNDBEZYYAWDAU-UHFFFAOYSA-N
Data  1 EC50
  Tab Delimited (TSV)   2D SDfile   Computed 3D by Vconf -m prep SDfile
Find this compound or compounds like it in BindingDB:
Activity Spreadsheet -- Enzyme Inhibition Constant Data from BindingDB
Found 1 hit for monomerid = 50513517
TargetNuclear receptor subfamily 1 group I member 3(Homo sapiens (Human))
University Of Maryland
Curated by ChEMBL
LigandPNGBDBM50513517(CHEMBL4577011)
Affinity DataEC50:  560nM. Assay description: Agonist activity at human constitutive androstane receptor expressed in HepG2 cells co-expressing CYP2B6 incubated for 23 hrs by One-Glo luciferase r...
Ligand InfoPC cidPC sid
In DepthDetails ArticlePubMed