BDBM50513771 CHEMBL4455546
SMILES COc1cc2nccc(Oc3ccc(NC(=O)N\N=C\c4cn(nn4)-c4cccc(F)c4)cc3)c2cc1OC
InChI Key InChIKey=FFZLHHSCAPHRBD-FJEPWZHXSA-N
Data  1 IC50
  Tab Delimited (TSV)   2D SDfile   Computed 3D by Vconf -m prep SDfile
Find this compound or compounds like it in BindingDB:
Activity Spreadsheet -- Enzyme Inhibition Constant Data from BindingDB
Found 1 hit for monomerid = 50513771
TargetReceptor-type tyrosine-protein kinase FLT3(Homo sapiens (Human))
Shenyang Pharmaceutical University
Curated by ChEMBL
LigandPNGBDBM50513771(CHEMBL4455546)
Affinity DataIC50:  384nM. Assay description: Inhibition of FLT3 (unknown origin) using peptide as substrate preincubated with enzyme for 10 mins followed by substrate addition further incubated ...
Ligand InfoPC cidPC sid
In DepthDetails ArticlePubMed