BDBM50514008 CHEMBL4450581::US10894782, No 11
SMILES CC(C)NCC#Cc1ccc(OCc2nnc(SC3CCCC3)n2-c2cccnc2)cc1C
InChI Key InChIKey=HDMRXIDIJWESIK-UHFFFAOYSA-N
Data  2 IC50
  Tab Delimited (TSV)   2D SDfile   Computed 3D by Vconf -m prep SDfile
Find this compound or compounds like it in BindingDB:
Activity Spreadsheet -- Enzyme Inhibition Constant Data from BindingDB
Found 2 hits for monomerid = 50514008
TargetTransitional endoplasmic reticulum ATPase(Homo sapiens (Human))
University of Pittsburgh
US Patent
LigandPNGBDBM50514008(CHEMBL4450581 | US10894782, No 11)
Affinity DataIC50:  7nM. Assay description: Biomol Green (Enzo) is a bioluminescent, homogeneous assay that measures ADP formed from a biochemical reaction. Because of its high sensitivity, the...
Ligand InfoPC cidPC sid
In DepthDetails US Patent
TargetTransitional endoplasmic reticulum ATPase(Homo sapiens (Human))
University of Pittsburgh
US Patent
LigandPNGBDBM50514008(CHEMBL4450581 | US10894782, No 11)
Affinity DataIC50:  7nM. Assay description: Inhibition of p97 (unknown origin) assessed as reduction in ATPase activity by biomol green reagent based assay
Ligand InfoPC cidPC sid
In DepthDetails ArticlePubMed