BDBM50514063 CHEMBL4447001
SMILES CC(C)c1nc2nc(C)c(cc2[nH]1)-c1ccc(C[C@H](NC(=O)[C@H]2CC[C@H](CN)CC2)C(=O)Nc2ccc(cc2)-c2nnc([nH]2)C(F)(F)C(F)(F)C(O)=O)cc1
InChI Key InChIKey=ZJYAXUISSVXYQC-HTLVZCCDSA-N
Data  3 IC50
  Tab Delimited (TSV)   2D SDfile   Computed 3D by Vconf -m prep SDfile
Find this compound or compounds like it in BindingDB:
Activity Spreadsheet -- Enzyme Inhibition Constant Data from BindingDB
Found 3 hits for monomerid = 50514063
TargetPlasminogen(Homo sapiens (Human))
Philipps University Marburg
Curated by ChEMBL
LigandPNGBDBM50514063(CHEMBL4447001)
Affinity DataIC50:  0.420nM. Assay description: Inhibition of human plasmin preincubated for 15 mins followed by MeOSuc-Ala-Phe-Lys-AMC substrate addition and measured after 30 mins by fluorescence...
Ligand InfoPC cidPC sid
In DepthDetails ArticlePubMed
TargetPlasma kallikrein(Homo sapiens (Human))
Philipps University Marburg
Curated by ChEMBL
LigandPNGBDBM50514063(CHEMBL4447001)
Affinity DataIC50:  1.70nM. Assay description: Inhibition of human plasma kallikrein preincubated for 15 mins followed by H-Pro-Phe-Arg-AMC substrate addition and measured after 30 mins by fluores...
Ligand InfoPC cidPC sid
In DepthDetails ArticlePubMed
TargetCoagulation factor XI(Homo sapiens (Human))
Philipps University Marburg
Curated by ChEMBL
LigandPNGBDBM50514063(CHEMBL4447001)
Affinity DataIC50: <0.130nM. Assay description: Inhibition of human factor 11a preincubated for 15 mins followed by Boc-Glu (OBzl) -Ala-Arg-AMC and measured after 30 mins by fluorescence method
Ligand InfoPC cidPC sid
In DepthDetails ArticlePubMed