BDBM50514576 CHEMBL4543790
SMILES O=C1N(C[C@@H]2CC(=NO2)c2cccs2)S(=O)(=O)c2ccccc12
InChI Key InChIKey=YPMBTZWFMDTVIO-JTQLQIEISA-N
Data  4 KI
  Tab Delimited (TSV)   2D SDfile   Computed 3D by Vconf -m prep SDfile
Find this compound or compounds like it in BindingDB:
Activity Spreadsheet -- Enzyme Inhibition Constant Data from BindingDB
Found 4 hits for monomerid = 50514576
TargetCarbonic anhydrase 12(Homo sapiens (Human))
Sapienza University Of Rome
Curated by ChEMBL
LigandPNGBDBM50514576(CHEMBL4543790)
Affinity DataKi:  1nM. Assay description: Inhibition of recombinant human carbonic anhydrase 12 incubated for 15 mins prior to testing measured for 10 to 100 secs by phenol red-based stopped-...
Ligand InfoPC cidPC sid
In DepthDetails ArticlePubMed
TargetCarbonic anhydrase 9(Homo sapiens (Human))
Sapienza University Of Rome
Curated by ChEMBL
LigandPNGBDBM50514576(CHEMBL4543790)
Affinity DataKi:  2.40nM. Assay description: Inhibition of recombinant human carbonic anhydrase 9 incubated for 15 mins prior to testing measured for 10 to 100 secs by phenol red-based stopped-f...
Ligand InfoPC cidPC sid
In DepthDetails ArticlePubMed
TargetCarbonic anhydrase 2(Homo sapiens (Human))
Sapienza University Of Rome
Curated by ChEMBL
LigandPNGBDBM50514576(CHEMBL4543790)
Affinity DataKi:  13nM. Assay description: Inhibition of recombinant human carbonic anhydrase 2 incubated for 15 mins prior to testing measured for 10 to 100 secs by phenol red-based stopped-f...
Ligand InfoPC cidPC sid
In DepthDetails ArticlePubMed
TargetCarbonic anhydrase 1(Homo sapiens (Human))
Sapienza University Of Rome
Curated by ChEMBL
LigandPNGBDBM50514576(CHEMBL4543790)
Affinity DataKi:  365nM. Assay description: Inhibition of recombinant human carbonic anhydrase 1 incubated for 15 mins prior to testing measured for 10 to 100 secs by phenol red-based stopped-f...
Ligand InfoPC cidPC sid
In DepthDetails ArticlePubMed